{"text_format":"3","workbook":"xlsx","n_sheets":23,"sheets":["Kat. I","Kat. II","Jan.","Feb.","März","April","Mai","Juni","Juli","Aug.","Sept.","Okt.","Nov.","Dez.","Auszug","Statistik","Bilanz","Journal","Trennung","Steuerabschluss","Dialog1","Dialog2","Dialog3"],"not_rendered":{"charts":1,"macros":1,"defined_names":36},"unopened":[{"sheet":"Dialog1","index":20,"reason":"not_a_worksheet"},{"sheet":"Dialog2","index":21,"reason":"not_a_worksheet"},{"sheet":"Dialog3","index":22,"reason":"not_a_worksheet"}],"read":"whole","date_system":"1900"}

{"sheet":"Kat. I","index":0,"n_rows":780,"n_cols":29,"rows_kept":780}
["Einnahmen und Ausgaben nach Kategorien",{"$nulls":7},{"$f":"CONCATENATE(\"Januar \",$A$2)","v":"Januar "},null,null,{"$f":"CONCATENATE(\"Kategoriengruppen Januar \",$A$2)","v":"Kategoriengruppen Januar "},{"$nulls":4},{"$f":"CONCATENATE(\"Kategoriengruppen Januar \",$A$2)","v":"Kategoriengruppen Januar "},{"$nulls":7},1,"Januar",false,true,false]
[null,2,1,{"$nulls":22},"Februar",false,true,false]
[{"$nulls":25},"März",false,true,false]
["Einnahmenkategorien",{"$nulls":4},"Ausgabenkategorien",{"$nulls":5},"Einnahmengruppen","Vergleich","Ausgabengruppen",null,null,"Einnahmengruppen","Vergleich","Ausgabengruppen",{"$nulls":6},"April",false,true,false]
[{"$nulls":25},"Mai",false,true,false]
["Kat.","G.","Beschreibung","CHF",null,"Kat.","G.","Beschreibung",{"$f":"$D$6","v":"CHF"},{"$nulls":16},"Juni",true,true,false]
{"$rows_left_out":775}
{"sheet":"Kat. II","index":1,"n_rows":115,"n_cols":19,"rows_kept":115}
["Jahresübersicht der Einnahmenkategorien",{"$nulls":17},"Liste der Textbausteine"]
[]
["Kat.","Beschreibung","Januar","Februar","März","April","Mai","Juni","Juli","August","September","Oktober","November","Dezember",{"$f":"'Kat. I'!$A$2","v":0},null,null,"a"]
[{"$f":"IF('Kat. I'!A7=\"\",\"\",'Kat. I'!A7)","v":100},{"$f":"IF('Kat. I'!C7=\"\",\"\",'Kat. I'!C7)","v":"Ladenverkauf"},{"$f":"IF('Kat. I'!$C7=\"\",\"\",'Kat. I'!$D7)","v":0},{"$f":"IF('Kat. I'!$C67=\"\",\"\",'Kat. I'!$D67)","v":0},{"$f":"IF('Kat. I'!$C127=\"\",\"\",'Kat. I'!$D127)","v":0},{"$f":"IF('Kat. I'!$C187=\"\",\"\",'Kat. I'!$D187)","v":0},{"$f":"IF('Kat. I'!$C247=\"\",\"\",'Kat. I'!$D247)","v":0},{"$f":"IF('Kat. I'!$C307=\"\",\"\",'Kat. I'!$D307)","v":0},{"$f":"IF('Kat. I'!$C367=\"\",\"\",'Kat. I'!$D367)","v":0},{"$f":"IF('Kat. I'!$C427=\"\",\"\",'Kat. I'!$D427)","v":0},{"$f":"IF('Kat. I'!$C487=\"\",\"\",'Kat. I'!$D487)","v":0},{"$f":"IF('Kat. I'!$C547=\"\",\"\",'Kat. I'!$D547)","v":0},{"$f":"IF('Kat. I'!$C607=\"\",\"\",'Kat. I'!$D607)","v":0},{"$f":"IF('Kat. I'!$C667=\"\",\"\",'Kat. I'!$D667)","v":0},{"$f":"IF(B4=\"\",\"\",SUM(C4:N4))","v":0},null,null,"b"]
[{"$f":"IF('Kat. I'!A8=\"\",\"\",'Kat. I'!A8)","v":101},{"$f":"IF('Kat. I'!C8=\"\",\"\",'Kat. I'!C8)","v":"Verkauf über Internet"},{"$f":"IF('Kat. I'!$C8=\"\",\"\",'Kat. I'!$D8)","v":0},{"$f":"IF('Kat. I'!$C68=\"\",\"\",'Kat. I'!$D68)","v":0},{"$f":"IF('Kat. I'!$C128=\"\",\"\",'Kat. I'!$D128)","v":0},{"$f":"IF('Kat. I'!$C188=\"\",\"\",'Kat. I'!$D188)","v":0},{"$f":"IF('Kat. I'!$C248=\"\",\"\",'Kat. I'!$D248)","v":0},{"$f":"IF('Kat. I'!$C308=\"\",\"\",'Kat. I'!$D308)","v":0},{"$f":"IF('Kat. I'!$C368=\"\",\"\",'Kat. I'!$D368)","v":0},{"$f":"IF('Kat. I'!$C428=\"\",\"\",'Kat. I'!$D428)","v":0},{"$f":"IF('Kat. I'!$C488=\"\",\"\",'Kat. I'!$D488)","v":0},{"$f":"IF('Kat. I'!$C548=\"\",\"\",'Kat. I'!$D548)","v":0},{"$f":"IF('Kat. I'!$C608=\"\",\"\",'Kat. I'!$D608)","v":0},{"$f":"IF('Kat. I'!$C668=\"\",\"\",'Kat. I'!$D668)","v":0},{"$f":"IF(B5=\"\",\"\",SUM(C5:N5))","v":0},null,null,"c"]
[{"$f":"IF('Kat. I'!A9=\"\",\"\",'Kat. I'!A9)","v":102},{"$f":"IF('Kat. I'!C9=\"\",\"\",'Kat. I'!C9)","v":""},{"$f":"IF('Kat. I'!$C9=\"\",\"\",'Kat. I'!$D9)","v":""},{"$f":"IF('Kat. I'!$C69=\"\",\"\",'Kat. I'!$D69)","v":""},{"$f":"IF('Kat. I'!$C129=\"\",\"\",'Kat. I'!$D129)","v":""},{"$f":"IF('Kat. I'!$C189=\"\",\"\",'Kat. I'!$D189)","v":""},{"$f":"IF('Kat. I'!$C249=\"\",\"\",'Kat. I'!$D249)","v":""},{"$f":"IF('Kat. I'!$C309=\"\",\"\",'Kat. I'!$D309)","v":""},{"$f":"IF('Kat. I'!$C369=\"\",\"\",'Kat. I'!$D369)","v":""},{"$f":"IF('Kat. I'!$C429=\"\",\"\",'Kat. I'!$D429)","v":""},{"$f":"IF('Kat. I'!$C489=\"\",\"\",'Kat. I'!$D489)","v":""},{"$f":"IF('Kat. I'!$C549=\"\",\"\",'Kat. I'!$D549)","v":""},{"$f":"IF('Kat. I'!$C609=\"\",\"\",'Kat. I'!$D609)","v":""},{"$f":"IF('Kat. I'!$C669=\"\",\"\",'Kat. I'!$D669)","v":""},"",null,null,"d"]
{"$rows_left_out":110}
{"sheet":"Jan.","index":2,"n_rows":39,"n_cols":14,"rows_kept":39}
[{"$f":"CONCATENATE(Jan.!$A$2,\" Januar \",'Kat. I'!$A$2)","v":"Finanzübersicht (Erfolgsrechnung) Monat Januar "},{"$nulls":9},{"$f":"CONCATENATE(Jan.!$K$2,\" Januar \",'Kat. I'!$A$2)","v":" Januar "}]
["Finanzübersicht (Erfolgsrechnung) Monat",null,"Januar"]
["Filter Aus",{"$nulls":9},1,2,3,4]
["Eigenkapitalentwicklung:",{"$nulls":3},"Laufende Rechnung:",{"$nulls":5},"Anfangsbestand","Anfangsbestand","Anfangsbestand","Anfangsbestand"]
[{"$nulls":10},{"v":1000,"d":"1,000.00"},{"v":1000,"d":"1,000.00"}]
[{"$f":"SUM($K$5:$IV$5)","v":{"v":2000,"d":"2,000.00"}},{"$f":"CONCATENATE(\" Stand des Eigenkapitals am 1. Januar \",'Kat. I'!$A$2)","v":" Stand des Eigenkapitals am 1. Januar "},null,null,"aktuell:",null,"aktuell:",{"$nulls":3},"aktuell:","aktuell:","aktuell:","aktuell:"]
{"$rows_left_out":34}
{"sheet":"Feb.","index":3,"n_rows":39,"n_cols":14,"rows_kept":39}
[{"$f":"CONCATENATE(Jan.!A2,\" Februar \",'Kat. I'!$A$2)","v":"Finanzübersicht (Erfolgsrechnung) Monat Februar "},{"$nulls":9},{"$f":"CONCATENATE(Jan.!$K$2,\" Februar \",'Kat. I'!$A$2)","v":" Februar "}]
[null,null,"Februar"]
["Filter Aus",{"$nulls":9},1,2,3,4]
["Eigenkapitalentwicklung:",{"$nulls":3},"Laufende Rechnung:",{"$nulls":5},"Anfangsbestand","Anfangsbestand","Anfangsbestand","Anfangsbestand"]
[{"$nulls":10},{"$f":"Jan.!K7","v":{"v":1560.75,"d":"1,560.75"}},{"$f":"Jan.!L7","v":{"v":-70,"d":"- 70.00"}},{"$f":"Jan.!M7","v":{"v":0,"d":"0.00"}},{"$f":"Jan.!N7","v":{"v":0,"d":"0.00"}}]
[{"$f":"Jan.!$A$6","v":{"v":2000,"d":"2,000.00"}},{"$f":"CONCATENATE(\" Stand des Eigenkapitals am 1. Januar \",'Kat. I'!$A$2)","v":" Stand des Eigenkapitals am 1. Januar "},null,null,"aktuell:",null,"aktuell:",{"$nulls":3},"aktuell:","aktuell:","aktuell:","aktuell:"]
{"$rows_left_out":34}
{"sheet":"März","index":4,"n_rows":39,"n_cols":14,"rows_kept":39}
[{"$f":"CONCATENATE(Jan.!$A$2,\" März \",'Kat. I'!$A$2)","v":"Finanzübersicht (Erfolgsrechnung) Monat März "},{"$nulls":9},{"$f":"CONCATENATE(Jan.!$K$2,\" März \",'Kat. I'!$A$2)","v":" März "}]
[null,null,"März"]
["Filter Aus",{"$nulls":9},1,2,3,4]
["Eigenkapitalentwicklung:",{"$nulls":3},"Laufende Rechnung:",{"$nulls":5},"Anfangsbestand","Anfangsbestand","Anfangsbestand","Anfangsbestand"]
[{"$nulls":10},{"$f":"Feb.!K7","v":{"v":1560.75,"d":"1,560.75"}},{"$f":"Feb.!L7","v":{"v":-70,"d":"- 70.00"}},{"$f":"Feb.!M7","v":{"v":0,"d":"0.00"}},{"$f":"Feb.!N7","v":{"v":0,"d":"0.00"}}]
[{"$f":"Jan.!$A$6","v":{"v":2000,"d":"2,000.00"}},{"$f":"CONCATENATE(\" Stand des Eigenkapitals am 1. Januar \",'Kat. I'!$A$2)","v":" Stand des Eigenkapitals am 1. Januar "},null,null,"aktuell:",null,"aktuell:",{"$nulls":3},"aktuell:","aktuell:","aktuell:","aktuell:"]
{"$rows_left_out":34}
{"sheet":"April","index":5,"n_rows":39,"n_cols":14,"rows_kept":39}
[{"$f":"CONCATENATE(Jan.!$A$2,\" April \",'Kat. I'!$A$2)","v":"Finanzübersicht (Erfolgsrechnung) Monat April "},{"$nulls":9},{"$f":"CONCATENATE(Jan.!$K$2,\" April \",'Kat. I'!$A$2)","v":" April "}]
[null,null,"April"]
["Filter Aus",{"$nulls":9},1,2,3,4]
["Eigenkapitalentwicklung:",{"$nulls":3},"Laufende Rechnung:",{"$nulls":5},"Anfangsbestand","Anfangsbestand","Anfangsbestand","Anfangsbestand"]
[{"$nulls":10},{"$f":"März!K7","v":{"v":1560.75,"d":"1,560.75"}},{"$f":"März!L7","v":{"v":-70,"d":"- 70.00"}},{"$f":"März!M7","v":{"v":0,"d":"0.00"}},{"$f":"März!N7","v":{"v":0,"d":"0.00"}}]
[{"$f":"Jan.!$A$6","v":{"v":2000,"d":"2,000.00"}},{"$f":"CONCATENATE(\" Stand des Eigenkapitals am 1. Januar \",'Kat. I'!$A$2)","v":" Stand des Eigenkapitals am 1. Januar "},null,null,"aktuell:",null,"aktuell:",{"$nulls":3},"aktuell:","aktuell:","aktuell:","aktuell:"]
{"$rows_left_out":34}
{"sheet":"Mai","index":6,"n_rows":39,"n_cols":14,"rows_kept":39}
[{"$f":"CONCATENATE(Jan.!$A$2,\" Mai \",'Kat. I'!$A$2)","v":"Finanzübersicht (Erfolgsrechnung) Monat Mai "},{"$nulls":9},{"$f":"CONCATENATE(Jan.!$K$2,\" Mai \",'Kat. I'!$A$2)","v":" Mai "}]
[null,null,"Mai"]
["Filter Aus",{"$nulls":9},1,2,3,4]
["Eigenkapitalentwicklung:",{"$nulls":3},"Laufende Rechnung:",{"$nulls":5},"Anfangsbestand","Anfangsbestand","Anfangsbestand","Anfangsbestand"]
[{"$nulls":10},{"$f":"April!K7","v":{"v":1560.75,"d":"1,560.75"}},{"$f":"April!L7","v":{"v":-70,"d":"- 70.00"}},{"$f":"April!M7","v":{"v":0,"d":"0.00"}},{"$f":"April!N7","v":{"v":0,"d":"0.00"}}]
[{"$f":"Jan.!$A$6","v":{"v":2000,"d":"2,000.00"}},{"$f":"CONCATENATE(\" Stand des Eigenkapitals am 1. Januar \",'Kat. I'!$A$2)","v":" Stand des Eigenkapitals am 1. Januar "},null,null,"aktuell:",null,"aktuell:",{"$nulls":3},"aktuell:","aktuell:","aktuell:","aktuell:"]
{"$rows_left_out":34}
{"sheet":"Juni","index":7,"n_rows":39,"n_cols":14,"rows_kept":39}
[{"$f":"CONCATENATE(Jan.!$A$2,\" Juni \",'Kat. I'!$A$2)","v":"Finanzübersicht (Erfolgsrechnung) Monat Juni "},{"$nulls":9},{"$f":"CONCATENATE(Jan.!$K$2,\" Juni \",'Kat. I'!$A$2)","v":" Juni "}]
[null,null,"Juni"]
["Filter Aus",{"$nulls":9},1,2,3,4]
["Eigenkapitalentwicklung:",{"$nulls":3},"Laufende Rechnung:",{"$nulls":5},"Anfangsbestand","Anfangsbestand","Anfangsbestand","Anfangsbestand"]
[{"$nulls":10},{"$f":"Mai!K7","v":{"v":1560.75,"d":"1,560.75"}},{"$f":"Mai!L7","v":{"v":-70,"d":"- 70.00"}},{"$f":"Mai!M7","v":{"v":0,"d":"0.00"}},{"$f":"Mai!N7","v":{"v":0,"d":"0.00"}}]
[{"$f":"Jan.!$A$6","v":{"v":2000,"d":"2,000.00"}},{"$f":"CONCATENATE(\" Stand des Eigenkapitals am 1. Januar \",'Kat. I'!$A$2)","v":" Stand des Eigenkapitals am 1. Januar "},null,null,"aktuell:",null,"aktuell:",{"$nulls":3},"aktuell:","aktuell:","aktuell:","aktuell:"]
{"$rows_left_out":34}
{"sheet":"Juli","index":8,"n_rows":39,"n_cols":14,"rows_kept":39}
[{"$f":"CONCATENATE(Jan.!$A$2,\" Juli \",'Kat. I'!$A$2)","v":"Finanzübersicht (Erfolgsrechnung) Monat Juli "},{"$nulls":9},{"$f":"CONCATENATE(Jan.!$K$2,\" Juli \",'Kat. I'!$A$2)","v":" Juli "}]
[null,null,"Juli"]
["Filter Aus",{"$nulls":9},1,2,3,4]
["Eigenkapitalentwicklung:",{"$nulls":3},"Laufende Rechnung:",{"$nulls":5},"Anfangsbestand","Anfangsbestand","Anfangsbestand","Anfangsbestand"]
[{"$nulls":10},{"$f":"Juni!K7","v":{"v":1560.75,"d":"1,560.75"}},{"$f":"Juni!L7","v":{"v":-70,"d":"- 70.00"}},{"$f":"Juni!M7","v":{"v":0,"d":"0.00"}},{"$f":"Juni!N7","v":{"v":0,"d":"0.00"}}]
[{"$f":"Jan.!$A$6","v":{"v":2000,"d":"2,000.00"}},{"$f":"CONCATENATE(\" Stand des Eigenkapitals am 1. Januar \",'Kat. I'!$A$2)","v":" Stand des Eigenkapitals am 1. Januar "},null,null,"aktuell:",null,"aktuell:",{"$nulls":3},"aktuell:","aktuell:","aktuell:","aktuell:"]
{"$rows_left_out":34}
{"sheet":"Aug.","index":9,"n_rows":39,"n_cols":14,"rows_kept":39}
[{"$f":"CONCATENATE(Jan.!$A$2,\" August \",'Kat. I'!$A$2)","v":"Finanzübersicht (Erfolgsrechnung) Monat August "},{"$nulls":9},{"$f":"CONCATENATE(Jan.!$K$2,\" August \",'Kat. I'!$A$2)","v":" August "}]
[null,null,"August"]
["Filter Aus",{"$nulls":9},1,2,3,4]
["Eigenkapitalentwicklung:",{"$nulls":3},"Laufende Rechnung:",{"$nulls":5},"Anfangsbestand","Anfangsbestand","Anfangsbestand","Anfangsbestand"]
[{"$nulls":10},{"$f":"Juli!K7","v":{"v":1560.75,"d":"1,560.75"}},{"$f":"Juli!L7","v":{"v":-70,"d":"- 70.00"}},{"$f":"Juli!M7","v":{"v":0,"d":"0.00"}},{"$f":"Juli!N7","v":{"v":0,"d":"0.00"}}]
[{"$f":"Jan.!$A$6","v":{"v":2000,"d":"2,000.00"}},{"$f":"CONCATENATE(\" Stand des Eigenkapitals am 1. Januar \",'Kat. I'!$A$2)","v":" Stand des Eigenkapitals am 1. Januar "},null,null,"aktuell:",null,"aktuell:",{"$nulls":3},"aktuell:","aktuell:","aktuell:","aktuell:"]
{"$rows_left_out":34}
{"sheet":"Sept.","index":10,"n_rows":39,"n_cols":14,"rows_kept":39}
[{"$f":"CONCATENATE(Jan.!$A$2,\" September \",'Kat. I'!$A$2)","v":"Finanzübersicht (Erfolgsrechnung) Monat September "},{"$nulls":9},{"$f":"CONCATENATE(Jan.!$K$2,\" September \",'Kat. I'!$A$2)","v":" September "}]
[null,null,"September"]
["Filter Aus",{"$nulls":9},1,2,3,4]
["Eigenkapitalentwicklung:",{"$nulls":3},"Laufende Rechnung:",{"$nulls":5},"Anfangsbestand","Anfangsbestand","Anfangsbestand","Anfangsbestand"]
[{"$nulls":10},{"$f":"Aug.!K7","v":{"v":1560.75,"d":"1,560.75"}},{"$f":"Aug.!L7","v":{"v":-70,"d":"- 70.00"}},{"$f":"Aug.!M7","v":{"v":0,"d":"0.00"}},{"$f":"Aug.!N7","v":{"v":0,"d":"0.00"}}]
[{"$f":"Jan.!$A$6","v":{"v":2000,"d":"2,000.00"}},{"$f":"CONCATENATE(\" Stand des Eigenkapitals am 1. Januar \",'Kat. I'!$A$2)","v":" Stand des Eigenkapitals am 1. Januar "},null,null,"aktuell:",null,"aktuell:",{"$nulls":3},"aktuell:","aktuell:","aktuell:","aktuell:"]
{"$rows_left_out":34}
{"sheet":"Okt.","index":11,"n_rows":39,"n_cols":14,"rows_kept":39}
[{"$f":"CONCATENATE(Jan.!$A$2,\" Oktober \",'Kat. I'!$A$2)","v":"Finanzübersicht (Erfolgsrechnung) Monat Oktober "},{"$nulls":9},{"$f":"CONCATENATE(Jan.!$K$2,\" Oktober \",'Kat. I'!$A$2)","v":" Oktober "}]
[null,null,"Oktober"]
["Filter Aus",{"$nulls":9},1,2,3,4]
["Eigenkapitalentwicklung:",{"$nulls":3},"Laufende Rechnung:",{"$nulls":5},"Anfangsbestand","Anfangsbestand","Anfangsbestand","Anfangsbestand"]
[{"$nulls":10},{"$f":"Sept.!K7","v":{"v":1560.75,"d":"1,560.75"}},{"$f":"Sept.!L7","v":{"v":-70,"d":"- 70.00"}},{"$f":"Sept.!M7","v":{"v":0,"d":"0.00"}},{"$f":"Sept.!N7","v":{"v":0,"d":"0.00"}}]
[{"$f":"Jan.!$A$6","v":{"v":2000,"d":"2,000.00"}},{"$f":"CONCATENATE(\" Stand des Eigenkapitals am 1. Januar \",'Kat. I'!$A$2)","v":" Stand des Eigenkapitals am 1. Januar "},null,null,"aktuell:",null,"aktuell:",{"$nulls":3},"aktuell:","aktuell:","aktuell:","aktuell:"]
{"$rows_left_out":34}
{"sheet":"Nov.","index":12,"n_rows":39,"n_cols":14,"rows_kept":39}
[{"$f":"CONCATENATE(Jan.!$A$2,\" November \",'Kat. I'!$A$2)","v":"Finanzübersicht (Erfolgsrechnung) Monat November "},{"$nulls":9},{"$f":"CONCATENATE(Jan.!$K$2,\" November \",'Kat. I'!$A$2)","v":" November "}]
[null,null,"November"]
["Filter Aus",{"$nulls":9},1,2,3,4]
["Eigenkapitalentwicklung:",{"$nulls":3},"Laufende Rechnung:",{"$nulls":5},"Anfangsbestand","Anfangsbestand","Anfangsbestand","Anfangsbestand"]
[{"$nulls":10},{"$f":"Okt.!K7","v":{"v":1560.75,"d":"1,560.75"}},{"$f":"Okt.!L7","v":{"v":-70,"d":"- 70.00"}},{"$f":"Okt.!M7","v":{"v":0,"d":"0.00"}},{"$f":"Okt.!N7","v":{"v":0,"d":"0.00"}}]
[{"$f":"Jan.!$A$6","v":{"v":2000,"d":"2,000.00"}},{"$f":"CONCATENATE(\" Stand des Eigenkapitals am 1. Januar \",'Kat. I'!$A$2)","v":" Stand des Eigenkapitals am 1. Januar "},null,null,"aktuell:",null,"aktuell:",{"$nulls":3},"aktuell:","aktuell:","aktuell:","aktuell:"]
{"$rows_left_out":34}
{"sheet":"Dez.","index":13,"n_rows":39,"n_cols":14,"rows_kept":39}
[{"$f":"CONCATENATE(Jan.!$A$2,\" Dezember \",'Kat. I'!$A$2)","v":"Finanzübersicht (Erfolgsrechnung) Monat Dezember "},{"$nulls":9},{"$f":"CONCATENATE(Jan.!$K$2,\" Dezember \",'Kat. I'!$A$2)","v":" Dezember "}]
[null,null,"Dezember"]
["Filter Aus",{"$nulls":9},1,2,3,4]
["Eigenkapitalentwicklung:",{"$nulls":3},"Laufende Rechnung:",{"$nulls":5},"Anfangsbestand","Anfangsbestand","Anfangsbestand","Anfangsbestand"]
[{"$nulls":10},{"$f":"Nov.!K7","v":{"v":1560.75,"d":"1,560.75"}},{"$f":"Nov.!L7","v":{"v":-70,"d":"- 70.00"}},{"$f":"Nov.!M7","v":{"v":0,"d":"0.00"}},{"$f":"Nov.!N7","v":{"v":0,"d":"0.00"}}]
[{"$f":"Jan.!$A$6","v":{"v":2000,"d":"2,000.00"}},{"$f":"CONCATENATE(\" Stand des Eigenkapitals am 1. Januar \",'Kat. I'!$A$2)","v":" Stand des Eigenkapitals am 1. Januar "},null,null,"aktuell:",null,"aktuell:",{"$nulls":3},"aktuell:","aktuell:","aktuell:","aktuell:"]
{"$rows_left_out":34}
{"sheet":"Auszug","index":14,"n_rows":14,"n_cols":8,"rows_kept":14}
["Auszug"]
[]
["Filter Aus","Teilergebnisse Aus"]
[null,null," "]
{"$rows_empty":9}
["Datum","Beleg","Text","Kat.","Ein","Kat.","Aus","Kto."]
{"$rows_left_out":1}
{"sheet":"Statistik","index":15,"n_rows":158,"n_cols":53,"rows_kept":158}
[{"$f":"\"Statistik: Eigenkapitalentwicklung Januar \"&('Kat. I'!A2+1)-$B$47& \" bis Dezember \"&'Kat. I'!A2","v":"Statistik: Eigenkapitalentwicklung Januar 0 bis Dezember "}]
{"$rows_empty":42}
["Benzinbezug für Auto (PW)"]
[]
[]
["Bereich:",1,"Jahr",{"$nulls":11},"Bereich:",1,"Jahr",null,"Bereich:",2,"Jahre",null,"Bereich:",3,"Jahre",null,"Bereich:",4,"Jahre",null,"Bereich:",5,"Jahre",null,"Bereich:",6,"Jahre",null,"Bereich:",7,"Jahre",null,"Bereich:",8,"Jahre",null,"Bereich:",9,"Jahre",null,"Bereich:",10,"Jahre"]
{"$rows_left_out":112}
{"sheet":"Bilanz","index":16,"n_rows":39,"n_cols":9,"rows_kept":39,"merged":[[0,2,0,3]]}
["Bilanz per",null,{"$f":"IF(I1<>\"\",\"\",C2&\" \"&'Kat. I'!A2)","v":"31. Dezember "}]
[null,null,"31. Dezember"]
["Dez.!",null,"Aktiven",{"$nulls":4},"Passiven"]
["Vermögensart","Kto.","Vermögenspositionen","Betrag",null,"Finanzierungsart","Kto.","Finanzierungspositionen","Betrag"]
["Umlaufvermögen",null,{"$f":"IF(B5=\"\",\"\",CONCATENATE(HLOOKUP(B5,Dez.!$K$3:$IV$14,10,0),\" \",HLOOKUP(B5,Dez.!$K$3:$IV$14,12,0)))","v":""},{"$f":"IF(B5=\"\",\"\",HLOOKUP(B5,Dez.!$K$3:$IV$7,5,0))","v":""},null,"Fremdkapital",null,{"$f":"IF(G5=\"\",\"\",CONCATENATE(HLOOKUP(G5,Dez.!$K$3:$IV$14,10,0),\" \",HLOOKUP(G5,Dez.!$K$3:$IV$14,12,0)))","v":""},{"$f":"IF(G5=\"\",\"\",HLOOKUP(G5,Dez.!$K$3:$IV$7,5,0)-HLOOKUP(G5,Dez.!$K$3:$IV$7,5,0)*2)","v":""}]
[{"$f":"SUM(D5:D25)","v":0},null,{"$f":"IF(B6=\"\",\"\",CONCATENATE(HLOOKUP(B6,Dez.!$K$3:$IV$14,10,0),\" \",HLOOKUP(B6,Dez.!$K$3:$IV$14,12,0)))","v":""},{"$f":"IF(B6=\"\",\"\",HLOOKUP(B6,Dez.!$K$3:$IV$7,5,0))","v":""},null,{"$f":"SUM(I5:I25)","v":0},null,{"$f":"IF(G6=\"\",\"\",CONCATENATE(HLOOKUP(G6,Dez.!$K$3:$IV$14,10,0),\" \",HLOOKUP(G6,Dez.!$K$3:$IV$14,12,0)))","v":""},{"$f":"IF(G6=\"\",\"\",HLOOKUP(G6,Dez.!$K$3:$IV$7,5,0)-HLOOKUP(G6,Dez.!$K$3:$IV$7,5,0)*2)","v":""}]
{"$rows_left_out":34}
{"sheet":"Journal","index":17,"n_rows":38,"n_cols":10,"rows_kept":38}
[{"$f":"\"Journal der Kapitalverschiebungen, Kapitalerträge und Vermögensverwaltungsspesen \"&'Kat. I'!A2","v":"Journal der Kapitalverschiebungen, Kapitalerträge und Vermögensverwaltungsspesen "}]
[{"$nulls":7},"Nicht erfasst sind Verschiebungen Postkonto - Kasse, Zuflüsse aus Erwerbstätigkeiten und reguläre Ausgaben."]
[{"$nulls":3},"bewegtes",{"$f":"\"Erträge in \"&'Kat. I'!D6","v":"Erträge in CHF"}]
["ID","Valuta","Vorgang",{"$f":"\"Kapital in \"&'Kat. I'!D6","v":"Kapital in CHF"},"Brutto","V.-Steuer","Netto","Spesen","Kontrolle","Gutschrift"]
{"$rows_empty":31}
[null,null,"Total",{"$f":"SUM(D5:D35)","v":{"v":0,"d":"0.00"}},{"$f":"SUM(E5:E35)","v":{"v":0,"d":"0.00"}},{"$f":"SUM(F5:F35)","v":{"v":0,"d":"0.00"}},{"$f":"SUM(G5:G35)","v":{"v":0,"d":"0.00"}},{"$f":"SUM(H5:H35)","v":{"v":0,"d":"0.00"}}]
{"$rows_left_out":3}
{"sheet":"Trennung","index":18,"n_rows":89,"n_cols":24,"rows_kept":89,"merged":[[5,2,5,11],[6,5,6,7],[7,5,7,7],[9,0,9,1],[9,7,9,8],[10,0,10,1],[10,7,10,8],[12,2,12,4],[12,9,12,11],[32,2,32,4],[32,9,32,11],[52,2,52,4],[52,9,52,11],[72,2,72,4],[72,9,72,11],[92,2,92,4],[92,9,92,11],[112,2,112,4],[112,9,112,11],[132,2,132,4],[132,9,132,11],[152,2,152,4],[152,9,152,11],[172,2,172,4],[172,9,172,11],[192,2,192,4],[192,9,192,11],[212,2,212,4],[212,9,212,11],[232,2,232,4],[232,9,232,11],[252,2,252,4],[252,9,252,11],[272,2,272,4],[272,9,272,11],[292,2,292,4],[292,9,292,11],[312,2,312,4],[312,9,312,11],[332,2,332,4],[332,9,332,11],[352,2,352,4],[352,9,352,11]]}
[{"$f":"\"Abschluss Teil 1.1: Trennung der Konten in Betrieb / privat zwecks Ermittlung Betriebseinkommen Jahr \"&'Kat. I'!$A$2","v":"Abschluss Teil 1.1: Trennung der Konten in Betrieb / privat zwecks Ermittlung Betriebseinkommen Jahr "}]
["Trennung gemäss Tabellenblatt \"Kat. I\". Es wird vorausgesetzt dass der Betrieb die niedrigeren Kategoriennummern hat . Es können maximal 30 Konten getrennt werden."]
["Zum Abschluss gehören auch die beiden Formulare \"Ergänzungen zum Abschluss\" (Ziffern 3-9) und \"Inventar\" (Ziffern 11-21)."]
["Letzte Betriebskategorie auf der Einnahmenseite:",{"$nulls":3},124,{"$f":"\"<=\"&E4","v":"<=124"},{"$f":"\"<=\"&H4","v":"<=224"},224," Letzte Betriebskategorie auf der Ausgabenseite"]
["Erste Privatkategorie auf der Einnahmenseite:",{"$nulls":3},125,{"$f":"\">=\"&E5","v":">=125"},{"$f":"\">=\"&H5","v":">=225"},225," Erste Privatkategorie auf der Ausgabenseite"]
[null,null,{"$f":"IF(OR(E4=\"\",E5=\"\",H4=\"\",H5=\"\"),\"Achtung: Alle vier Kategorienfelder müssen ausgefüllt sein ! Die Kategorien sind auf dem Blatt Kat I ersichtlich !\",\"\")","v":""}]
{"$rows_left_out":84}
{"sheet":"Steuerabschluss","index":19,"n_rows":122,"n_cols":7,"rows_kept":122,"merged":[[4,1,4,3],[4,4,4,6],[67,3,67,4],[67,5,67,6]]}
[{"$f":"\"Abschluss Teil 10.1: Einkommensrechnung \"&\"Jahr \"&'Kat. I'!$A$2","v":"Abschluss Teil 10.1: Einkommensrechnung Jahr "}]
["Ermittlung des Einkommens aus betrieblicher Tätigkeit für die Steuererklärung"]
["HINWEIS: Alle Konten der Monatsblätter müssen auf dem Blatt \"Trennung\" eingeschaltet sein (max. 30 möglich)."]
[]
[null,"Betrieb",null,null,"Privat"]
[null,"Einnahmen","Ausgaben","Saldo","Einnahmen","Ausgaben","Saldo"]
{"$rows_left_out":93}